Uploaded image for project: 'OS Images'
  1. OS Images
  2. IMAGES-855

Puppet Agent Build error on new Win-2012r2-x86_64 May 2018 image

    XMLWordPrintable

    Details

    • Type: Bug
    • Status: Resolved
    • Priority: Blocker
    • Resolution: Fixed
    • Affects Version/s: None
    • Fix Version/s: None
    • Labels:
    • Template:
    • Acceptance Criteria:
      Hide

      New set of Images with Windows updates to May 2018 included deployed to vmpooler.

      Show
      New set of Images with Windows updates to May 2018 included deployed to vmpooler.
    • Team:
      Windows
    • Story Points:
      5
    • Sprint:
      Windows 2018-06-13, Windows 2018-06-20
    • Method Found:
      Needs Assessment
    • QA Risk Assessment:
      Needs Assessment

      Description

      Have had to revertĀ win-2012r2-x86_64 as the PA build fails with a libtool error.

      Gist of failed build: https://gist.github.com/jcoconnor/c71352b01cd0570882ebba1d6f2e4bb9
      And a shortened Gist: https://gist.github.com/jcoconnor/f9f75a06e587197961c125135aafd8f6

      Project agent-runtime (master) Runtime Pipeline (puppet-agent 1.10.x) Step 03 – Project Packaging

      00:16:04.492 touch curl-configure
      00:16:04.586 export PATH="/cygdrive/c/tools/mingw64/bin:/bin:/cygdrive/c/Windows/system32:/cygdrive/c/Windows:/cygdrive/c/Windows/System32/Wbem:/cygdrive/c/Windows/System32/WindowsPowerShell/v1.0:/cygdrive/c/Program Files/Git/cmd:/cygdrive/c/Packer/SysInternals" && \
      00:16:04.586 export CYGWIN="nodosfilewarning winsymlinks:native" && \
      00:16:04.586 cd curl-7.59.0 && \
      00:16:04.586 /usr/bin/make -j3
      00:16:04.601 make[1]: Entering directory '/var/tmp/tmp.PTKiQxSkXm/curl-7.59.0'
      00:16:04.617 Making all in lib
      00:16:04.680 make[2]: Entering directory '/var/tmp/tmp.PTKiQxSkXm/curl-7.59.0/lib'
      00:16:04.711 /usr/bin/make  all-am
      00:16:04.759 make[3]: Entering directory '/var/tmp/tmp.PTKiQxSkXm/curl-7.59.0/lib'
      00:16:04.776   CC       libcurl_la-file.lo
       
      [ ... ] Removed
       
      0:17:27.558 make[3]: Leaving directory '/var/tmp/tmp.PTKiQxSkXm/curl-7.59.0/lib'
      00:17:27.558 ../libtool: eval: line 1735: syntax error near unexpected token `|'
      00:17:27.558 ../libtool: eval: line 1735: `nm  .libs/libcurl_la-file.o .libs/libcurl_la-timeval.o .libs/libcurl_la-base64.o .libs/libcurl_la-hostip.o .libs/libcurl_la-progress.o .libs/libcurl_la-formdata.o .libs/libcurl_la-cookie.o .libs/libcurl_la-http.o .libs/libcurl_la-sendf.o .libs/libcurl_la-ftp.o .libs/libcurl_la-url.o .libs/libcurl_la-dict.o .libs/libcurl_la-if2ip.o .libs/libcurl_la-speedcheck.o .libs/libcurl_la-ldap.o .libs/libcurl_la-version.o .libs/libcurl_la-getenv.o .libs/libcurl_la-escape.o .libs/libcurl_la-mprintf.o .libs/libcurl_la-telnet.o .libs/libcurl_la-netrc.o .libs/libcurl_la-getinfo.o .libs/libcurl_la-transfer.o .libs/libcurl_la-strcase.o .libs/libcurl_la-easy.o .libs/libcurl_la-security.o .libs/libcurl_la-curl_fnmatch.o .libs/libcurl_la-fileinfo.o .libs/libcurl_la-ftplistparser.o .libs/libcurl_la-wildcard.o .libs/libcurl_la-krb5.o .libs/libcurl_la-memdebug.o .libs/libcurl_la-http_chunks.o .libs/libcurl_la-strtok.o .libs/libcurl_la-connect.o .libs/libcurl_la-llist.o .libs/libcurl_la-hash.o .libs/libcurl_la-multi.o .libs/libcurl_la-content_encoding.o .libs/libcurl_la-share.o .libs/libcurl_la-http_digest.o .libs/libcurl_la-md4.o .libs/libcurl_la-md5.o .libs/libcurl_la-http_negotiate.o .libs/libcurl_la-inet_pton.o .libs/libcurl_la-strtoofft.o .libs/libcurl_la-strerror.o .libs/libcurl_la-amigaos.o .libs/libcurl_la-hostasyn.o .libs/libcurl_la-hostip4.o .libs/libcurl_la-hostip6.o .libs/libcurl_la-hostsyn.o .libs/libcurl_la-inet_ntop.o .libs/libcurl_la-parsedate.o .libs/libcurl_la-select.o .libs/libcurl_la-tftp.o .libs/libcurl_la-splay.o .libs/libcurl_la-strdup.o .libs/libcurl_la-socks.o .libs/libcurl_la-ssh.o .libs/libcurl_la-ssh-libssh.o .libs/libcurl_la-curl_addrinfo.o .libs/libcurl_la-socks_gssapi.o .libs/libcurl_la-socks_sspi.o .libs/libcurl_la-curl_sspi.o .libs/libcurl_la-slist.o .libs/libcurl_la-nonblock.o .libs/libcurl_la-curl_memrchr.o .libs/libcurl_la-imap.o .libs/libcurl_la-pop3.o .libs/libcurl_la-smtp.o .libs/libcurl_la-pingpong.o .libs/libcurl_la-rtsp.o .libs/libcurl_la-curl_threads.o .libs/libcurl_la-warnless.o .libs/libcurl_la-hmac.o .libs/libcurl_la-curl_rtmp.o .libs/libcurl_la-openldap.o .libs/libcurl_la-curl_gethostname.o .libs/libcurl_la-gopher.o .libs/libcurl_la-idn_win32.o .libs/libcurl_la-http_proxy.o .libs/libcurl_la-non-ascii.o .libs/libcurl_la-asyn-ares.o .libs/libcurl_la-asyn-thread.o .libs/libcurl_la-curl_gssapi.o .libs/libcurl_la-http_ntlm.o .libs/libcurl_la-curl_ntlm_wb.o .libs/libcurl_la-curl_ntlm_core.o .libs/libcurl_la-curl_sasl.o .libs/libcurl_la-rand.o .libs/libcurl_la-curl_multibyte.o .libs/libcurl_la-hostcheck.o .libs/libcurl_la-conncache.o .libs/libcurl_la-pipeline.o .libs/libcurl_la-dotdot.o .libs/libcurl_la-x509asn1.o .libs/libcurl_la-http2.o .libs/libcurl_la-smb.o .libs/libcurl_la-curl_endian.o .libs/libcurl_la-curl_des.o .libs/libcurl_la-system_win32.o .libs/libcurl_la-mime.o .libs/libcurl_la-sha256.o .libs/libcurl_la-setopt.o .libs/libcurl_la-curl_path.o .libs/libcurl_la-curl_ctype.o .libs/libcurl_la-curl_range.o vauth/.libs/libcurl_la-vauth.o vauth/.libs/libcurl_la-cleartext.o vauth/.libs/libcurl_la-cram.o vauth/.libs/libcurl_la-digest.o vauth/.libs/libcurl_la-digest_sspi.o vauth/.libs/libcurl_la-krb5_gssapi.o vauth/.libs/libcurl_la-krb5_sspi.o vauth/.libs/libcurl_la-ntlm.o vauth/.libs/libcurl_la-ntlm_sspi.o vauth/.libs/libcurl_la-oauth2.o vauth/.libs/libcurl_la-spnego_gssapi.o vauth/.libs/libcurl_la-spnego_sspi.o vtls/.libs/libcurl_la-openssl.o vtls/.libs/libcurl_la-gtls.o vtls/.libs/libcurl_la-vtls.o vtls/.libs/libcurl_la-nss.o vtls/.libs/libcurl_la-polarssl.o vtls/.libs/libcurl_la-polarssl_threadlock.o vtls/.libs/libcurl_la-axtls.o vtls/.libs/libcurl_la-cyassl.o vtls/.libs/libcurl_la-schannel.o vtls/.libs/libcurl_la-darwinssl.o vtls/.libs/libcurl_la-gskit.o vtls/.libs/libcurl_la-mbedtls.o   |  | /bin/sed -e '/^[BCDGRS][ ]/s/.*[ ]\([^ ]*\)/\1 DATA/;s/^.*[ ]__nm__\([^ ]*\)[ ][^ ]*/\1 DATA/;/^I[ ]/d;/^[AITW][ ]/s/.* //' | sort | uniq > .libs/libcurl.exp'
      00:17:27.558 make[3]: *** [Makefile:903: libcurl.la] Error 2
      00:17:27.571 make[2]: *** [Makefile:744: all] Error 2
      00:17:27.571 make[1]: *** [Makefile:925: all-recursive] Error 1
      00:17:27.571 make: *** [Makefile:193: curl-build] Error 2
      00:17:27.571 make[2]: Leaving directory '/var/tmp/tmp.PTKiQxSkXm/curl-7.59.0/lib'
      00:17:27.571 make[1]: Leaving directory '/var/tmp/tmp.PTKiQxSkXm/curl-7.59.0'
      

        Attachments

          Issue Links

            Activity

              People

              Assignee:
              john.oconnor John O'Connor
              Reporter:
              john.oconnor John O'Connor
              Votes:
              0 Vote for this issue
              Watchers:
              2 Start watching this issue

                Dates

                Created:
                Updated:
                Resolved:

                  Zendesk Support